{"text_format":"1","workbook":"xlsx","n_sheets":4,"sheets":["INICIO","INSTRUCCIONES","JUEGO","RESULTADOS"],"not_rendered":{"charts":0,"images":66,"macros":1,"external_links":0,"defined_names":1,"comments":1,"pivot_tables":0},"unopened":[],"bounds":{"document_bytes":16777216,"sheet_cells":100000,"rows_first":2000,"rows_last":500,"rows_between":2000,"halvings":0,"cell_chars":16384,"cell_head_chars":4096},"cells_cut":0,"cells_raw":0,"read":"whole","date_system":"1900"}

{"sheet":"INICIO","index":0,"n_rows":0,"n_cols":0,"rows_kept":0,"cut":false,"hidden":false,"merged":[]}

{"sheet":"INSTRUCCIONES","index":1,"n_rows":0,"n_cols":0,"rows_kept":0,"cut":false,"hidden":false,"merged":[]}

{"sheet":"JUEGO","index":2,"n_rows":54,"n_cols":18,"rows_kept":54,"cut":false,"hidden":false,"merged":[[25,14,25,15],[41,2,41,3],[41,6,41,7],[41,10,41,11],[41,14,41,15],[25,2,25,3],[25,6,25,7],[25,10,25,11],[58,14,58,15],[74,2,74,3],[74,6,74,7],[74,10,74,11],[74,14,74,15],[58,2,58,3],[58,6,58,7],[58,10,58,11],[91,14,91,15],[108,2,108,3],[108,6,108,7],[108,10,108,11],[108,14,108,15],[91,2,91,3],[91,6,91,7],[91,10,91,11]]}
[]
[]
[]
[]
[]
[]
[]
[]
[]
[]
[]
[]
[]
[]
[]
[]
[]
[]
[]
[]
[]
[]
[]
[]
[]
[]
[]
[]
[]
[]
[]
[]
[]
[]
[]
[]
[]
[]
[]
[]
[]
[]
[]
[]
[]
[]
[]
[]
[]
[]
[]
[null,null,null,null,null,null,null,null,null,null,null,null,null,null,null,null,null,"Amarillo"]
[null,null,null,null,null,null,null,null,null,null,null,null,null,null,null,null,null,"Rojo"]
[null,null,null,null,null,null,null,null,null,null,null,null,null,null,null,null,null,"Verde"]

{"sheet":"RESULTADOS","index":3,"n_rows":122,"n_cols":15,"rows_kept":122,"cut":false,"hidden":false,"merged":[[10,2,11,15],[121,7,122,7],[26,2,26,3],[26,6,26,7],[26,10,26,11],[61,2,61,3],[61,6,61,7],[61,10,61,11],[96,2,96,3],[96,6,96,7],[96,10,96,11],[114,2,114,3],[114,6,114,7],[114,10,114,11],[28,2,28,3],[28,6,28,7],[26,14,26,15],[27,2,27,3],[27,6,27,7],[27,10,27,11],[27,14,27,15],[45,14,45,15],[45,10,45,11],[45,6,45,7],[96,14,96,15],[97,2,97,3],[97,6,97,7],[97,10,97,11],[97,14,97,15],[61,14,61,15],[62,2,62,3],[62,6,62,7],[62,10,62,11],[62,14,62,15],[80,2,80,3],[80,6,80,7],[80,10,80,11],[121,6,122,6],[121,4,122,5],[98,2,98,3],[98,6,98,7],[98,10,98,11],[115,2,115,3],[115,6,115,7],[115,10,115,11],[98,14,98,15],[116,2,116,3],[116,6,116,7],[116,10,116,11],[116,14,116,15],[114,14,114,15],[115,14,115,15],[80,14,80,15],[78,2,78,3],[78,6,78,7],[78,10,78,11],[78,14,78,15],[79,2,79,3],[79,6,79,7],[79,10,79,11],[79,14,79,15],[12,7,12,9],[63,2,63,3],[63,6,63,7],[63,10,63,11],[63,14,63,15],[45,2,45,3],[43,2,43,3],[43,6,43,7],[43,10,43,11],[43,14,43,15],[44,2,44,3],[44,6,44,7],[44,10,44,11],[44,14,44,15],[28,10,28,11],[28,14,28,15]]}
[]
[]
[]
[]
[]
[]
[]
[]
[]
[]
[null,null,{"$f":"IF(G122>=19,\"¡FELICIDADES!, tus conocimientos sobre nutrición son muy buenos\", \"¡FALLASTE! Recuerda leer tu plan te alimentación, vuelve a intentarlo.\")","v":"¡FALLASTE! Recuerda leer tu plan te alimentación, vuelve a intentarlo."}]
[]
[null,null,null,null,null,null,null,"Tu calificación es",null,null,{"$f":"G122","v":0},"puntos"]
[]
[]
[]
[]
[]
[]
[]
[]
[]
[]
[]
[]
[]
[null,null,{"$f":"JUEGO!C26:D26","v":0},null,null,null,{"$f":"JUEGO!G26:H26","v":0},null,null,null,{"$f":"JUEGO!K26:L26","v":0},null,null,null,{"$f":"JUEGO!N26:P26","v":0}]
[null,null,{"$f":"IF(C27 = \"AMARILLO\",\"CORRECTO\",\"INCORRECTO\")","v":"INCORRECTO"},null,null,null,{"$f":"IF(G27 = \"AMARILLO\",\"CORRECTO\",\"INCORRECTO\")","v":"INCORRECTO"},null,null,null,{"$f":"IF(K27 = \"AMARILLO\",\"CORRECTO\",\"INCORRECTO\")","v":"INCORRECTO"},null,null,null,{"$f":"IF(O27 = \"ROJO\",\"CORRECTO\",\"INCORRECTO\")","v":"INCORRECTO"}]
[null,null,"AMARILLO",null,null,null,"AMARILLO",null,null,null,"AMARILLO",null,null,null,"VERDE"]
[]
[]
[]
[]
[]
[]
[]
[]
[]
[]
[]
[]
[]
[]
[null,null,{"$f":"JUEGO!C42:D42","v":0},null,null,null,{"$f":"JUEGO!G42:H42","v":0},null,null,null,{"$f":"JUEGO!K42:L42","v":0},null,null,null,{"$f":"JUEGO!O42:P42","v":0}]
[null,null,{"$f":"IF(C44= \"ROJO\",\"CORRECTO\",\"INCORRECTO\")","v":"INCORRECTO"},null,null,null,{"$f":"IF(G44= \"AMARILLO\",\"CORRECTO\",\"INCORRECTO\")","v":"INCORRECTO"},null,null,null,{"$f":"IF(K44= \"VERDE\",\"CORRECTO\",\"INCORRECTO\")","v":"INCORRECTO"},null,null,null,{"$f":"IF(O44= \"AMARILLO\",\"CORRECTO\",\"INCORRECTO\")","v":"INCORRECTO"}]
[null,null,"ROJO",null,null,null,"AMARILLO",null,null,null,"VERDE",null,null,null,"AMARILLO"]
[]
[]
[]
[]
[]
[]
[]
[]
[]
[]
[]
[]
[]
[]
[]
[null,null,{"$f":"JUEGO!C59:D59","v":0},null,null,null,{"$f":"JUEGO!G59:H59","v":0},null,null,null,{"$f":"JUEGO!K59:L59","v":0},null,null,null,{"$f":"JUEGO!O59:P59","v":0}]
[null,null,{"$f":"IF(C62= \"AMARILLO\",\"CORRECTO\",\"INCORRECTO\")","v":"INCORRECTO"},null,null,null,{"$f":"IF(G62= \"VERDE\",\"CORRECTO\",\"INCORRECTO\")","v":"INCORRECTO"},null,null,null,{"$f":"IF(K62= \"ROJO\",\"CORRECTO\",\"INCORRECTO\")","v":"INCORRECTO"},null,null,null,{"$f":"IF(O62= \"AMARILLO\",\"CORRECTO\",\"INCORRECTO\")","v":"INCORRECTO"}]
[null,null,"AMARILLO",null,null,null,"VERDE",null,null,null,"ROJO",null,null,null,"AMARILLO"]
[]
[]
[]
[]
[]
[]
[]
[]
[]
[]
[]
[]
[]
[]
[null,null,{"$f":"JUEGO!C75:D75","v":0},null,null,null,{"$f":"JUEGO!G75:H75","v":0},null,null,null,{"$f":"JUEGO!K75:L75","v":0},null,null,null,{"$f":"JUEGO!O75:P75","v":0}]
[null,null,{"$f":"IF(C79= \"ROJO\",\"CORRECTO\",\"INCORRECTO\")","v":"INCORRECTO"},null,null,null,{"$f":"IF(G79= \"AMARILLO\",\"CORRECTO\",\"INCORRECTO\")","v":"INCORRECTO"},null,null,null,{"$f":"IF(K79= \"AMARILLO\",\"CORRECTO\",\"INCORRECTO\")","v":"INCORRECTO"},null,null,null,{"$f":"IF(G79= \"AMARILLO\",\"CORRECTO\",\"INCORRECTO\")","v":"INCORRECTO"}]
[null,null,"ROJO",null,null,null,"AMARILLO",null,null,null,"AMARILLO",null,null,null,"AMARILLO"]
[]
[]
[]
[]
[]
[]
[]
[]
[]
[]
[]
[]
[]
[]
[]
[null,null,{"$f":"JUEGO!C92:D92","v":0},null,null,null,{"$f":"JUEGO!G92:H92","v":0},null,null,null,{"$f":"JUEGO!K92:L92","v":0},null,null,null,{"$f":"JUEGO!O92:P92","v":0}]
[null,null,{"$f":"IF(C97= \"AMARILLO\",\"CORRECTO\",\"INCORRECTO\")","v":"INCORRECTO"},null,null,null,{"$f":"IF(G97= \"ROJO\",\"CORRECTO\",\"INCORRECTO\")","v":"INCORRECTO"},null,null,null,{"$f":"IF(K97= \"AMARILLO\",\"CORRECTO\",\"INCORRECTO\")","v":"INCORRECTO"},null,null,null,{"$f":"IF(O97= \"AMARILLO\",\"CORRECTO\",\"INCORRECTO\")","v":"INCORRECTO"}]
[null,null,"AMARILLO",null,null,null,"ROJO",null,null,null,"AMARILLO",null,null,null,"AMARILLO"]
[]
[]
[]
[]
[]
[]
[]
[]
[]
[]
[]
[]
[]
[]
[]
[null,null,{"$f":"JUEGO!C109:D109","v":0},null,null,null,{"$f":"JUEGO!G109:H109","v":0},null,null,null,{"$f":"JUEGO!K109:L109","v":0},null,null,null,{"$f":"JUEGO!O109:P109","v":0}]
[null,null,{"$f":"IF(C115= \"AMARILLO\",\"CORRECTO\",\"INCORRECTO\")","v":"INCORRECTO"},null,null,null,{"$f":"IF(G115= \"ROJO\",\"CORRECTO\",\"INCORRECTO\")","v":"INCORRECTO"},null,null,null,{"$f":"IF(K115= \"AMARILLO\",\"CORRECTO\",\"INCORRECTO\")","v":"INCORRECTO"},null,null,null,{"$f":"IF(O115= \"AMARILLO\",\"CORRECTO\",\"INCORRECTO\")","v":"INCORRECTO"}]
[null,null,"AMARILLO",null,null,null,"ROJO",null,null,null,"AMARILLO",null,null,null,"AMARILLO"]
[]
[]
[]
[]
[null,null,null,null,"TOTAL DE ACIERTOS",null,{"$f":"COUNTIF(C28:P116,\"CORRECTO\")","v":0},"de 24"]